آموزش جاوااسکریپت انجمن ها react native مشکل در اجرای react-native run-android جدید پاسخ به: مشکل در اجرای react-native run-android جدید

#16389
arash
مشارکت کننده

با نسخه های پایین تر هم تست شد اما همون خطا رو داره میده . فک کنم خود react native آپدیت شد این مشکل به وجود اومد. چجوری میتونم پاکش کنم از اول نصب کنم.
الان تو پروژه های قبلی این خطا رو میده
app:installDebug FAILEDnstallDebug

FAILURE: Build failed with an exception.

* What went wrong:
Execution failed for task ‘:app:installDebug’.
> com.android.builder.testing.api.DeviceException: com.android.ddmlib.InstallException: Failed to finalize session : INSTALL_FAILED_UPDATE_INCOMPATIBLE: Package com.dateconvertor signatures do not match the previously installed version; ignoring!

* Try:
Run with –stacktrace option to get the stack trace. Run with –info or –debug option to get more log output.

BUILD FAILED

Total time: 15.617 secs
Could not install the app on the device, read the error above for details.
Make sure you have an Android emulator running or a device connected and have
set up your Android development environment:
https://facebook.github.io/react-native/docs/getting-started.html
دیگه نمیدونم چیکار باید بکنم . لطفاً یه راهنمایی بکنید.